{"text_format":"1","workbook":"xlsx","n_sheets":12,"sheets":["Sheet2","data","emtiaz","data markaz","%markaz","گزارش","تجهیزات","عملکرد","ویژه","مشاوره","مراقبت","مقایسه ای مراکز"],"not_rendered":{"charts":14,"images":0,"macros":1,"external_links":0,"defined_names":0,"comments":0,"pivot_tables":0},"unopened":[{"sheet":"تجهیزات","index":6,"reason":"not_a_worksheet"},{"sheet":"عملکرد","index":7,"reason":"not_a_worksheet"},{"sheet":"ویژه","index":8,"reason":"not_a_worksheet"},{"sheet":"مشاوره","index":9,"reason":"not_a_worksheet"},{"sheet":"مراقبت","index":10,"reason":"not_a_worksheet"},{"sheet":"مقایسه ای مراکز","index":11,"reason":"not_a_worksheet"}],"bounds":{"document_bytes":16777216,"sheet_cells":100000,"rows_first":2000,"rows_last":500,"rows_between":2000,"halvings":0,"cell_chars":16384,"cell_head_chars":4096},"cells_cut":0,"cells_raw":0,"read":"whole","date_system":"1900"}

{"sheet":"Sheet2","index":0,"n_rows":27,"n_cols":7,"rows_kept":27,"cut":false,"hidden":false,"merged":[]}
[]
[]
[]
[null,"امتیاز ویژه اضافه در نظر گرفته شده",null,null,null,null,"نام مرکز"]
[null,null,null,null,null,null,"شهرستان اسلامشهر"]
[null,null,null,null,null,null,"سعیدیه"]
[null,null,null,null,null,null,"احمد آباد"]
[null,null,null,null,null,null,"باغ فیض"]
[null,null,null,null,null,null,"انبیا"]
[null,null,null,null,null,null,"چهاردانگه"]
[null,null,null,null,null,null,"قائمیه"]
[null,null,null,null,null,null,"قاسم آباد "]
[null,null,null,null,null,null,"واوان"]
[null,null,null,null,null,null,"گلشهر"]
[null,null,null,null,null,null,"گلدسته"]
[null,null,null,null,null,null,"شاطره"]
[null,null,null,null,null,null,"مهر ضیاء آباد"]
[null,null,null,null,null,null,"موسی آباد"]
[null,null,null,null,null,null,"گلها"]
[null,null,null,null,null,null,"حسن آباد"]
[null,null,null,null,null,null,"حسین آباد"]
[null,null,null,null,null,null,"بهرام آباد"]
[null,null,null,null,null,null,"مهرواوان"]
[null,null,null,null,null,null,"شهرک امام حسین"]
[null,null,null,null,null,null,"فرمانفرمایان"]
[null,null,null,null,null,null,"بدر"]
[null,null,null,null,null,null,"اکبرآباد "]

{"sheet":"data","index":1,"n_rows":42,"n_cols":8,"rows_kept":42,"cut":false,"hidden":false,"merged":[[41,0,41,1],[0,0,0,7],[1,7,2,7],[30,0,32,0],[33,0,35,0],[1,1,2,1],[38,0,40,0],[18,0,22,0],[25,0,26,0],[27,0,29,0],[3,0,17,0],[1,2,2,2],[1,3,2,3]]}
["چک لیست نظارتی عملکرد کارشناس تغذیه -  فقط قسمت سفید رنگ بر اساس کلیه مراکز و پایگاه ها تکمیل شود."]
["ابتدا روی لینک مراکز کلیک کنید و نام مراکز را وارد کنید","فعالیت","حدانتظار","امتیاز خدمت (به ازای هر واحد از آن خدمت)","تعداد خدمت کارشناس تغذیه","نمره","درصد رسیدن به حدانتظار خدمت","مدرک مورد نیاز برای ارزیابی "]
["مراکز",null,null,null,null,{"$f":"E3","v":0},{"$f":"E3","v":0}]
["سوال های عملکردی","ثبت ارزیابی (مراقبت)در سامانه سیب در سه ماهه اخیر",{"$f":"96*3","v":288},5,317,{"$f":"IF(E4>=C4,D4,E4/C4*D4)","v":5},{"$f":"F4/D4","v":1}]
[null,"ثبت آموزش فردی(اقدام) در سامانه سیب در سه ماهه اخیر",{"$f":"144*3","v":432},6,706,{"$f":"IF(E5>=C5,D5,E5/C5*D5)","v":6},{"$f":"F5/D5","v":1}]
[null," ثبت برنامه غذایی در سامانه سیب در سه ماهه اخیر",{"$f":"20*3","v":60},10,70,10,1]
[null," جلسه آموزش برون  بخشی/گروهی در سه ماهه اخیر",{"$f":"4*3","v":12},4,12,4,1]
[null," جلسه آموزش درون  بخشی درگروه در سه ماهه اخیر",{"$f":"4*3","v":12},4,12,4,1]
[null,"آیا برنامه عملیاتی (برنامه مداخله ای) سالیانه و جدول گانت  مطابق با مشکلات شایع منطقه در ابتدای سال طراحی شده و در حال اجرا می باشد؟  ",1,5,1,5,1,"تهيه برنامه عملياتي مطابق با اهداف ابلاغی"]
[null,"آیا فعالیت های پیش بینی شده برنامه عملیاتی طبق جدول زمان بندی انجام گرفته است؟",1,2,1,2,1,"مشاهده مستندات"]
[null,"آیا اطلاعات جمعیتی  سالانه (گروه سنی و مراکز جمعی و مدارس) و شاخص های مربوط به مشکلات تغذیه منطقه را استخراج و نموده است؟",2,3,2,3,1,"ابتدای سال اطلاعات جمعیتی (گروههای سنی و مراکز جمعی)  منطقه و شاخص مربوط به تن سنجی ، الگوی مصرف نامناسب مشاوره بیماریهای غیر واگیر هر شش ماه"]
[null,"حضور درجلسه با کارشناس مسئول شهرستان هر سه ماه ",1,2,2,2,1,"گواهی شرکت در جلسه"]
[null,"بازدید مراقبین سلامت/ بهورز هر سه ماه",1,2,2,2,1,"مستندات بازدید"]
[null,"آگاهی سنجی کارشناس تغذیه از طریق آزمون (هر شش ماه یکبار)",1,2,2,2,1,"(ازمون از بسته خدمت یا دستورالعمل ها)"]
[null,"حضور در دوره ها و کارگاه های آموزشی در یک سال اخیر",1,2,2,2,1,"گواهی شرکت"]
[null,"تولید محتوای آموزشی برای آموزش جامعه در یک سال اخیر",1,1,1,1,1,"بروشور/پمفلت/مطلب تهیه شده"]
[null,"ارسال به موقع آمار",1,2,1,2,1,"ارسال به موقع هر گونه آمار و اطلاعات  درخواستی از مافوق"]
[null,"بازدید  از مدارس (مکمل یاری) در  یک سال تحصیلی اخیر",1,4,1,4,1,"مستندات بازدید"]
["ابزار و ملزومات ارائه خدمات تغذیه ای در اتاق کارشناس تغذیه موجود است "," وجود و سالم بودن ترازوی کفه ای اطفال – ترازوی بزرگسال – قدسنج اطفال و بزرگسال وزنه شاهد 0.5 و 2  و 5 کیلوگرمی – کامپیوتر ، متر نواری و ماشین حساب",10,1,10,1,1,"به ازای هر وسیله سالم 1 امتیاز تعلق می گیرد"]
[null,"کالیبر بودن ترازوها و استاندارد بودن قدسنج ها",1,1,1,1,1]
[null,"موجود بودن فایل آمارهای جمعیتی و شیوع بیماریها ",1,1,1,1,1]
[null," بسته های آموزشی و خدمت تغذیه ",1,1,1,1,1]
[null," دستورالعمل های ابلاغی دفتر بهبود تغذیه جامعه",1,1,1,1,1]
[null,"پیگیری افراد ارجاع شده در سامانه سیب و ثبت آنها در قسمت\" ثبت تماس\" انجام شده است ",5,5,5,5,1,"(آیتم پیام ها در سامانه)"]
[null,"پیگیری و پایش تلفنی و مشاوره تغذیه برای کودکان کمتر از 5 سال حمایتی را انجام می دهد ",5,5,5,5,1]
["در سامانه سیب مراقبت  یک کودک طبق بسته خدمتی چک شود ","اقدام",4,2,4,2,1]
[null,"ثبت برنامه غذایی",2,2,2,2,1]
["در سامانه سیب مراقبت  یکی از گروه های سنی جوان/میانسال/ سالمند طبق بسته خدمتی چک شود ","اقدام",2,2,2,2,1]
[null,"ثبت برنامه غذایی",2,2,2,2,1]
[null,"بررسی فرم مراقبت تغذیه ",2,2,2,2,1]
{"$rows_left_out":13}
{"sheet":"emtiaz","index":2,"n_rows":42,"n_cols":7,"rows_kept":42,"cut":false,"hidden":false,"merged":[[33,0,35,0],[38,0,40,0],[41,0,41,1],[2,0,2,1],[3,0,17,0],[18,0,22,0],[25,0,26,0],[27,0,29,0],[30,0,32,0]]}
[]
[]
["فعالیت",null,"طیف امتیاز","جمع","درصد","فرمانفرمایان","بدر"]
["سوال های عملکردی","ثبت ارزیابی (مراقبت)در سامانه سیب در سه ماهه اخیر",5,{"$f":"SUM(F4:BC4)","v":9.3923611111111107},{"$f":"D4/C4/COUNT(F4:BC4)","v":0.93923611111111105},5,4.3923611111111107]
[null,"ثبت آموزش فردی(اقدام) در سامانه سیب در سه ماهه اخیر",6,{"$f":"SUM(F5:BC5)","v":12},{"$f":"D5/C5/COUNT(F5:BC5)","v":1},6,6]
[null," ثبت برنامه غذایی در سامانه سیب در سه ماهه اخیر",10,20,1,10,10]
[null," جلسه آموزش برون  بخشی/گروهی در سه ماهه اخیر",4,5.666666666666667,0.70833333333333337,4,1.6666666666666667]
[null," جلسه آموزش درون  بخشی درگروه در سه ماهه اخیر",4,8,1,4,4]
[null,"آیا برنامه عملیاتی (برنامه مداخله ای) سالیانه و جدول گانت  مطابق با مشکلات شایع منطقه در ابتدای سال طراحی شده و در حال اجرا می باشد؟  ",5,10,1,5,5]
[null,"آیا فعالیت های پیش بینی شده برنامه عملیاتی طبق جدول زمان بندی انجام گرفته است؟",2,4,1,2,2]
[null,"آیا اطلاعات جمعیتی  سالانه (گروه سنی و مراکز جمعی و مدارس) و شاخص های مربوط به مشکلات تغذیه منطقه را استخراج و نموده است؟",3,6,1,3,3]
[null,"حضور درجلسه با کارشناس مسئول شهرستان هر سه ماه ",2,4,1,2,2]
[null,"بازدید مراقبین سلامت/ بهورز هر سه ماه",2,4,1,2,2]
[null,"آگاهی سنجی کارشناس تغذیه از طریق آزمون (هر شش ماه یکبار)",2,4,1,2,2]
[null,"حضور در دوره ها و کارگاه های آموزشی در یک سال اخیر",2,4,1,2,2]
[null,"تولید محتوای آموزشی برای آموزش جامعه در یک سال اخیر",1,1,0.5,1,0]
[null,"ارسال به موقع آمار",2,4,1,2,2]
[null,"بازدید  از مدارس (مکمل یاری) در  یک سال تحصیلی اخیر",4,8,1,4,4]
["ابزار و ملزومات ارائه خدمات تغذیه ای در اتاق کارشناس تغذیه موجود است "," وجود و سالم بودن ترازوی کفه ای اطفال – ترازوی بزرگسال – قدسنج اطفال و بزرگسال وزنه شاهد 0.5 و 2  و 5 کیلوگرمی – کامپیوتر ، متر نواری و ماشین حساب",1,2,1,1,1]
[null,"کالیبر بودن ترازوها و استاندارد بودن قدسنج ها",1,2,1,1,1]
[null,"موجود بودن فایل آمارهای جمعیتی و شیوع بیماریها ",1,2,1,1,1]
[null," بسته های آموزشی و خدمت تغذیه ",1,2,1,1,1]
[null," دستورالعمل های ابلاغی دفتر بهبود تغذیه جامعه",1,2,1,1,1]
[null,"پیگیری افراد ارجاع شده در سامانه سیب و ثبت آنها در قسمت\" ثبت تماس\" انجام شده است ",5,10,1,5,5]
[null,"پیگیری و پایش تلفنی و مشاوره تغذیه برای کودکان کمتر از 5 سال حمایتی را انجام می دهد ",5,10,1,5,5]
["در سامانه سیب مراقبت  یک کودک طبق بسته خدمتی چک شود ","اقدام",2,4,1,2,2]
[null,"ثبت برنامه غذایی",2,4,1,2,2]
["در سامانه سیب مراقبت  یکی از گروه های سنی جوان/میانسال/ سالمند طبق بسته خدمتی چک شود ","اقدام",2,4,1,2,2]
[null,"ثبت برنامه غذایی",2,4,1,2,2]
[null,"بررسی فرم مراقبت تغذیه ",2,4,1,2,2]
{"$rows_left_out":13}
{"sheet":"data markaz","index":3,"n_rows":42,"n_cols":7,"rows_kept":42,"cut":false,"hidden":false,"merged":[[41,0,41,1],[2,0,2,1],[18,0,22,0],[25,0,26,0],[27,0,29,0],[30,0,32,0],[3,0,17,0],[33,0,35,0],[38,0,40,0]]}
[]
[]
["فعالیت",null,"حد انتظار خدمت",{"$f":"Sheet2!G5","v":"شهرستان اسلامشهر"},"درصد","فرمانفرمایان","بدر"]
["سوال های عملکردی","ثبت ارزیابی (مراقبت)در سامانه سیب در سه ماهه اخیر",288,{"$f":"SUM(F4:AI4)","v":541},{"$f":"D4/C4/COUNT(F4:AI4)","v":0.93923611111111116},288,253]
[null,"ثبت آموزش فردی(اقدام) در سامانه سیب در سه ماهه اخیر",432,{"$f":"SUM(F5:AI5)","v":1100},1.2731481481481481,432,668]
[null," ثبت برنامه غذایی در سامانه سیب در سه ماهه اخیر",60,120,1,60,60]
[null," جلسه آموزش برون  بخشی/گروهی در سه ماهه اخیر",12,17,0.70833333333333337,12,5]
[null," جلسه آموزش درون  بخشی درگروه در سه ماهه اخیر",12,24,1,12,12]
[null,"آیا برنامه عملیاتی (برنامه مداخله ای) سالیانه و جدول گانت  مطابق با مشکلات شایع منطقه در ابتدای سال طراحی شده و در حال اجرا می باشد؟  ",1,2,1,1,1]
[null,"آیا فعالیت های پیش بینی شده برنامه عملیاتی طبق جدول زمان بندی انجام گرفته است؟",1,2,1,1,1]
[null,"آیا اطلاعات جمعیتی  سالانه (گروه سنی و مراکز جمعی و مدارس) و شاخص های مربوط به مشکلات تغذیه منطقه را استخراج و نموده است؟",2,4,1,2,2]
[null,"حضور درجلسه با کارشناس مسئول شهرستان هر سه ماه ",1,2,1,1,1]
[null,"بازدید مراقبین سلامت/ بهورز هر سه ماه",1,2,1,1,1]
[null,"آگاهی سنجی کارشناس تغذیه از طریق آزمون (هر شش ماه یکبار)",1,2,1,1,1]
[null,"حضور در دوره ها و کارگاه های آموزشی در یک سال اخیر",1,2,1,1,1]
[null,"تولید محتوای آموزشی برای آموزش جامعه در یک سال اخیر",1,1,0.5,1,0]
[null,"ارسال به موقع آمار",1,2,1,1,1]
[null,"بازدید  از مدارس (مکمل یاری) در  یک سال تحصیلی اخیر",1,2,1,1,1]
["ابزار و ملزومات ارائه خدمات تغذیه ای در اتاق کارشناس تغذیه موجود است "," وجود و سالم بودن ترازوی کفه ای اطفال – ترازوی بزرگسال – قدسنج اطفال و بزرگسال وزنه شاهد 0.5 و 2  و 5 کیلوگرمی – کامپیوتر ، متر نواری و ماشین حساب",10,20,1,10,10]
[null,"کالیبر بودن ترازوها و استاندارد بودن قدسنج ها",1,2,1,1,1]
[null,"موجود بودن فایل آمارهای جمعیتی و شیوع بیماریها ",1,2,1,1,1]
[null," بسته های آموزشی و خدمت تغذیه ",1,2,1,1,1]
[null," دستورالعمل های ابلاغی دفتر بهبود تغذیه جامعه",1,2,1,1,1]
[null,"پیگیری افراد ارجاع شده در سامانه سیب و ثبت آنها در قسمت\" ثبت تماس\" انجام شده است ",5,10,1,5,5]
[null,"پیگیری و پایش تلفنی و مشاوره تغذیه برای کودکان کمتر از 5 سال حمایتی را انجام می دهد ",5,10,1,5,5]
["در سامانه سیب مراقبت  یک کودک طبق بسته خدمتی چک شود ","اقدام",4,8,1,4,4]
[null,"ثبت برنامه غذایی",2,4,1,2,2]
["در سامانه سیب مراقبت  یکی از گروه های سنی جوان/میانسال/ سالمند طبق بسته خدمتی چک شود ","اقدام",2,4,1,2,2]
[null,"ثبت برنامه غذایی",2,4,1,2,2]
[null,"بررسی فرم مراقبت تغذیه ",2,4,1,2,2]
{"$rows_left_out":13}
{"sheet":"%markaz","index":4,"n_rows":42,"n_cols":7,"rows_kept":42,"cut":false,"hidden":false,"merged":[[41,0,41,1],[2,0,2,1],[18,0,22,0],[25,0,26,0],[27,0,29,0],[30,0,32,0],[3,0,17,0],[33,0,35,0],[38,0,40,0]]}
[]
[]
["فعالیت",null," درصد حد انتظار خدمت","جمع","درصد","فرمانفرمایان","بدر"]
["سوال های عملکردی","ثبت ارزیابی (مراقبت)در سامانه سیب در سه ماهه اخیر",1,{"$f":"COUNTIF(F4:AE4,C4)","v":1},{"$f":"D4/COUNT(F4:AE4)","v":0.5},1,0.8784722222222221]
[null,"ثبت آموزش فردی(اقدام) در سامانه سیب در سه ماهه اخیر",1,2,1,1,1]
[null," ثبت برنامه غذایی در سامانه سیب در سه ماهه اخیر",1,2,1,1,1]
[null," جلسه آموزش برون  بخشی/گروهی در سه ماهه اخیر",1,1,0.5,1,0.41666666666666669]
[null," جلسه آموزش درون  بخشی درگروه در سه ماهه اخیر",1,2,1,1,1]
[null,"آیا برنامه عملیاتی (برنامه مداخله ای) سالیانه و جدول گانت  مطابق با مشکلات شایع منطقه در ابتدای سال طراحی شده و در حال اجرا می باشد؟  ",1,2,1,1,1]
[null,"آیا فعالیت های پیش بینی شده برنامه عملیاتی طبق جدول زمان بندی انجام گرفته است؟",1,2,1,1,1]
[null,"آیا اطلاعات جمعیتی  سالانه (گروه سنی و مراکز جمعی و مدارس) و شاخص های مربوط به مشکلات تغذیه منطقه را استخراج و نموده است؟",1,2,1,1,1]
[null,"حضور درجلسه با کارشناس مسئول شهرستان هر سه ماه ",1,2,1,1,1]
[null,"بازدید مراقبین سلامت/ بهورز هر سه ماه",1,2,1,1,1]
[null,"آگاهی سنجی کارشناس تغذیه از طریق آزمون (هر شش ماه یکبار)",1,2,1,1,1]
[null,"حضور در دوره ها و کارگاه های آموزشی در یک سال اخیر",1,2,1,1,1]
[null,"تولید محتوای آموزشی برای آموزش جامعه در یک سال اخیر",1,1,0.5,1,0]
[null,"ارسال به موقع آمار",1,2,1,1,1]
[null,"بازدید  از مدارس (مکمل یاری) در  یک سال تحصیلی اخیر",1,2,1,1,1]
["ابزار و ملزومات ارائه خدمات تغذیه ای در اتاق کارشناس تغذیه موجود است "," وجود و سالم بودن ترازوی کفه ای اطفال – ترازوی بزرگسال – قدسنج اطفال و بزرگسال وزنه شاهد 0.5 و 2  و 5 کیلوگرمی – کامپیوتر ، متر نواری و ماشین حساب",1,2,1,1,1]
[null,"کالیبر بودن ترازوها و استاندارد بودن قدسنج ها",1,2,1,1,1]
[null,"موجود بودن فایل آمارهای جمعیتی و شیوع بیماریها ",1,2,1,1,1]
[null," بسته های آموزشی و خدمت تغذیه ",1,2,1,1,1]
[null," دستورالعمل های ابلاغی دفتر بهبود تغذیه جامعه",1,2,1,1,1]
[null,"پیگیری افراد ارجاع شده در سامانه سیب و ثبت آنها در قسمت\" ثبت تماس\" انجام شده است ",1,2,1,1,1]
[null,"پیگیری و پایش تلفنی و مشاوره تغذیه برای کودکان کمتر از 5 سال حمایتی را انجام می دهد ",1,2,1,1,1]
["در سامانه سیب مراقبت  یک کودک طبق بسته خدمتی چک شود ","اقدام",1,2,1,1,1]
[null,"ثبت برنامه غذایی",1,2,1,1,1]
["در سامانه سیب مراقبت  یکی از گروه های سنی جوان/میانسال/ سالمند طبق بسته خدمتی چک شود ","اقدام",1,2,1,1,1]
[null,"ثبت برنامه غذایی",1,2,1,1,1]
[null,"بررسی فرم مراقبت تغذیه ",1,2,1,1,1]
{"$rows_left_out":13}
{"sheet":"گزارش","index":5,"n_rows":41,"n_cols":10,"rows_kept":41,"cut":false,"hidden":false,"merged":[[32,0,34,0],[37,0,39,0],[40,0,40,1],[2,0,16,0],[17,0,21,0],[24,0,25,0],[26,0,28,0],[29,0,31,0]]}
[null,null,null,"نام مرکز","شهرستان اسلامشهر"]
[null,"فعالیت","حدانتظار","امتیاز خدمت (به ازای هر واحد از آن خدمت)","تعداد خدمت کارشناس تغذیه","نمره","درصد رسیدن به حدانتظار خدمت",null,"فعالیت"]
["سوال های عملکردی","ثبت ارزیابی (مراقبت)در سامانه سیب در سه ماهه اخیر",{"$f":"96*3","v":288},5,{"$f":"HLOOKUP($E$1,'data markaz'!$D$3:$AL$42,2,0)","v":541},{"$f":"IF(E3>=C3,D3,E3/C3*D3)","v":5},{"$f":"IF($E$1=Sheet2!$G$5,'%markaz'!E4,F3/D3)","v":0.5},null,"ثبت ارزیابی در سامانه سیب ","ü"]
[null,"ثبت آموزش فردی(اقدام) در سامانه سیب در سه ماهه اخیر",{"$f":"144*3","v":432},6,{"$f":"HLOOKUP($E$1,'data markaz'!$D$3:$AL$42,3,0)","v":1100},{"$f":"IF(E4>=C4,D4,E4/C4*D4)","v":6},{"$f":"IF($E$1=Sheet2!$G$5,'%markaz'!E5,F4/D4)","v":1},null,"ثبت آموزش فردی در سامانه سیب "]
[null," ثبت برنامه غذایی در سامانه سیب در سه ماهه اخیر",{"$f":"20*3","v":60},10,{"$f":"HLOOKUP($E$1,'data markaz'!$D$3:$AL$42,4,0)","v":120},10,{"$f":"IF($E$1=Sheet2!$G$5,'%markaz'!E6,F5/D5)","v":1},null," ثبت برنامه غذایی در سامانه سیب "]
[null," جلسه آموزش برون  بخشی/گروهی در سه ماهه اخیر",{"$f":"4*3","v":12},4,{"$f":"HLOOKUP($E$1,'data markaz'!$D$3:$AL$42,5,0)","v":17},4,{"$f":"IF($E$1=Sheet2!$G$5,'%markaz'!E7,F6/D6)","v":0.5},null," برگزاری جلسه آموزش برون  بخشی"]
[null," جلسه آموزش درون  بخشی درگروه در سه ماهه اخیر",{"$f":"4*3","v":12},4,{"$f":"HLOOKUP($E$1,'data markaz'!$D$3:$AL$42,6,0)","v":24},4,{"$f":"IF($E$1=Sheet2!$G$5,'%markaz'!E8,F7/D7)","v":1},null," برگزاری جلسه آموزش درون  بخشی "]
[null,"آیا برنامه عملیاتی (برنامه مداخله ای) سالیانه و جدول گانت  مطابق با مشکلات شایع منطقه در ابتدای سال طراحی شده و در حال اجرا می باشد؟  ",1,5,{"$f":"HLOOKUP($E$1,'data markaz'!$D$3:$AL$42,7,0)","v":2},5,{"$f":"IF($E$1=Sheet2!$G$5,'%markaz'!E9,F8/D8)","v":1},null,"طراحی  برنامه عملیاتی  سالیانه ","ü"]
[null,"آیا فعالیت های پیش بینی شده برنامه عملیاتی طبق جدول زمان بندی انجام گرفته است؟",1,2,{"$f":"HLOOKUP($E$1,'data markaz'!$D$3:$AL$42,8,0)","v":2},2,{"$f":"IF($E$1=Sheet2!$G$5,'%markaz'!E10,F9/D9)","v":1},null,"انجام فعالیت های پیش بینی شده برنامه عملیاتی طبق برنامه"]
[null,"آیا اطلاعات جمعیتی  سالانه (گروه سنی و مراکز جمعی و مدارس) و شاخص های مربوط به مشکلات تغذیه منطقه را استخراج و نموده است؟",2,3,{"$f":"HLOOKUP($E$1,'data markaz'!$D$3:$AL$42,9,0)","v":4},3,{"$f":"IF($E$1=Sheet2!$G$5,'%markaz'!E11,F10/D10)","v":1},null,"استخراج  اطلاعات جمعیتی  و شاخص های مربوطه ","ü"]
[null,"حضور درجلسه با کارشناس مسئول شهرستان هر سه ماه ",1,2,{"$f":"HLOOKUP($E$1,'data markaz'!$D$3:$AL$42,10,0)","v":2},2,{"$f":"IF($E$1=Sheet2!$G$5,'%markaz'!E12,F11/D11)","v":1},null,"حضور درجلسه شهرستان"]
[null,"بازدید مراقبین سلامت/ بهورز هر سه ماه",1,2,{"$f":"HLOOKUP($E$1,'data markaz'!$D$3:$AL$42,11,0)","v":2},2,{"$f":"IF($E$1=Sheet2!$G$5,'%markaz'!E13,F12/D12)","v":1},null,"بازدید از برنامه های تغذیه مراقبین سلامت"]
[null,"آگاهی سنجی کارشناس تغذیه از طریق آزمون (هر شش ماه یکبار)",1,2,{"$f":"HLOOKUP($E$1,'data markaz'!$D$3:$AL$42,12,0)","v":2},2,{"$f":"IF($E$1=Sheet2!$G$5,'%markaz'!E14,F13/D13)","v":1},null,"آگاهی از بسته های آموزشی تغذیه  از طریق آزمون "]
[null,"حضور در دوره ها و کارگاه های آموزشی در یک سال اخیر",1,2,{"$f":"HLOOKUP($E$1,'data markaz'!$D$3:$AL$42,13,0)","v":2},2,{"$f":"IF($E$1=Sheet2!$G$5,'%markaz'!E15,F14/D14)","v":1},null,"حضور در دوره ها و کارگاه های آموزشی "]
[null,"تولید محتوای آموزشی برای آموزش جامعه در یک سال اخیر",1,1,{"$f":"HLOOKUP($E$1,'data markaz'!$D$3:$AL$42,14,0)","v":1},1,{"$f":"IF($E$1=Sheet2!$G$5,'%markaz'!E16,F15/D15)","v":0.5},null,"تولید محتوای آموزشی برای آموزش جامعه "]
[null,"ارسال به موقع آمار",1,2,{"$f":"HLOOKUP($E$1,'data markaz'!$D$3:$AL$42,15,0)","v":2},2,{"$f":"IF($E$1=Sheet2!$G$5,'%markaz'!E17,F16/D16)","v":1},null,"ارسال به موقع آمار"]
[null,"بازدید  از مدارس (مکمل یاری) در  یک سال تحصیلی اخیر",1,4,{"$f":"HLOOKUP($E$1,'data markaz'!$D$3:$AL$42,16,0)","v":2},4,{"$f":"IF($E$1=Sheet2!$G$5,'%markaz'!E18,F17/D17)","v":1},null,"بازدید  از برنامه مکمل یاری مدارس"]
["ابزار و ملزومات ارائه خدمات تغذیه ای در اتاق کارشناس تغذیه موجود است "," وجود و سالم بودن ترازوی کفه ای اطفال – ترازوی بزرگسال – قدسنج اطفال و بزرگسال وزنه شاهد 0.5 و 2  و 5 کیلوگرمی – کامپیوتر ، متر نواری و ماشین حساب",10,1,{"$f":"HLOOKUP($E$1,'data markaz'!$D$3:$AL$42,17,0)","v":20},1,{"$f":"IF($E$1=Sheet2!$G$5,'%markaz'!E19,F18/D18)","v":1},null," وجود و سالم بودن تجهیزات","ü"]
[null,"کالیبر بودن ترازوها و استاندارد بودن قدسنج ها",1,1,{"$f":"HLOOKUP($E$1,'data markaz'!$D$3:$AL$42,18,0)","v":2},1,{"$f":"IF($E$1=Sheet2!$G$5,'%markaz'!E20,F19/D19)","v":1},null,"کالیبر بودن ترازوها و استاندارد بودن قدسنج ها"]
[null,"موجود بودن فایل آمارهای جمعیتی و شیوع بیماریها ",1,1,{"$f":"HLOOKUP($E$1,'data markaz'!$D$3:$AL$42,19,0)","v":2},1,{"$f":"IF($E$1=Sheet2!$G$5,'%markaz'!E21,F20/D20)","v":1},null,"وجود فایل آمارهای جمعیتی و شیوع بیماریها "]
[null," بسته های آموزشی و خدمت تغذیه ",1,1,{"$f":"HLOOKUP($E$1,'data markaz'!$D$3:$AL$42,20,0)","v":2},1,{"$f":"IF($E$1=Sheet2!$G$5,'%markaz'!E22,F21/D21)","v":1},null,"وجود  بسته های آموزشی و خدمت تغذیه "]
[null," دستورالعمل های ابلاغی دفتر بهبود تغذیه جامعه",1,1,{"$f":"HLOOKUP($E$1,'data markaz'!$D$3:$AL$42,21,0)","v":2},1,{"$f":"IF($E$1=Sheet2!$G$5,'%markaz'!E23,F22/D22)","v":1},null," وجود دستورالعمل های ابلاغی دفتر بهبود تغذیه جامعه"]
[null,"پیگیری افراد ارجاع شده در سامانه سیب و ثبت آنها در قسمت\" ثبت تماس\" انجام شده است ",5,5,{"$f":"HLOOKUP($E$1,'data markaz'!$D$3:$AL$42,22,0)","v":10},5,{"$f":"IF($E$1=Sheet2!$G$5,'%markaz'!E24,F23/D23)","v":1},null,"پیگیری افراد ارجاع شده  و ثبت آنها در قسمت\" ثبت تماس\""]
[null,"پیگیری و پایش تلفنی و مشاوره تغذیه برای کودکان کمتر از 5 سال حمایتی را انجام می دهد ",5,5,{"$f":"HLOOKUP($E$1,'data markaz'!$D$3:$AL$42,23,0)","v":10},5,{"$f":"IF($E$1=Sheet2!$G$5,'%markaz'!E25,F24/D24)","v":1},null,"پیگیری و پایش تلفنی و مشاوره تغذیه برای کودکان کمتر از 5 سال حمایتی"]
["در سامانه سیب مراقبت  یک کودک طبق بسته خدمتی چک شود ","اقدام",4,2,{"$f":"HLOOKUP($E$1,'data markaz'!$D$3:$AL$42,24,0)","v":8},2,{"$f":"IF($E$1=Sheet2!$G$5,'%markaz'!E26,F25/D25)","v":1},null,"اقدام","ü"]
[null,"ثبت برنامه غذایی",2,2,{"$f":"HLOOKUP($E$1,'data markaz'!$D$3:$AL$42,25,0)","v":4},2,{"$f":"IF($E$1=Sheet2!$G$5,'%markaz'!E27,F26/D26)","v":1},null,"ثبت برنامه غذایی"]
["در سامانه سیب مراقبت  یکی از گروه های سنی جوان/میانسال/ سالمند طبق بسته خدمتی چک شود ","اقدام",2,2,{"$f":"HLOOKUP($E$1,'data markaz'!$D$3:$AL$42,26,0)","v":4},2,{"$f":"IF($E$1=Sheet2!$G$5,'%markaz'!E28,F27/D27)","v":1},null,"اقدام"]
[null,"ثبت برنامه غذایی",2,2,{"$f":"HLOOKUP($E$1,'data markaz'!$D$3:$AL$42,27,0)","v":4},2,{"$f":"IF($E$1=Sheet2!$G$5,'%markaz'!E29,F28/D28)","v":1},null,"ثبت برنامه غذایی"]
[null,"بررسی فرم مراقبت تغذیه ",2,2,{"$f":"HLOOKUP($E$1,'data markaz'!$D$3:$AL$42,28,0)","v":4},2,{"$f":"IF($E$1=Sheet2!$G$5,'%markaz'!E30,F29/D29)","v":1},null,"بررسی فرم مراقبت تغذیه "]
["در سامانه سیب مراقبت  یک مادر باردار طبق بسته خدمتی چک شود ","اقدام",2,2,{"$f":"HLOOKUP($E$1,'data markaz'!$D$3:$AL$42,29,0)","v":4},2,{"$f":"IF($E$1=Sheet2!$G$5,'%markaz'!E31,F30/D30)","v":1},null,"اقدام"]
{"$rows_left_out":11}